{"text_format":"1","workbook":"xlsx","n_sheets":5,"sheets":["Accueil","Ecoles","Saisie","Analyse Circo","listes"],"not_rendered":{"charts":4,"images":8,"macros":1,"external_links":1,"defined_names":4,"comments":0,"pivot_tables":0},"unopened":[],"bounds":{"document_bytes":16777216,"sheet_cells":100000,"rows_first":2000,"rows_last":500,"rows_between":2000,"halvings":0,"cell_chars":16384,"cell_head_chars":4096},"cells_cut":0,"cells_raw":0,"read":"whole","date_system":"1900"}

{"sheet":"Accueil","index":0,"n_rows":27,"n_cols":9,"rows_kept":27,"cut":false,"hidden":false,"merged":[[26,2,26,9],[30,2,30,5],[31,2,31,5],[32,2,32,5],[33,2,33,5],[24,1,24,2],[1,0,1,12],[2,1,2,2],[5,1,5,2],[7,2,7,10],[9,2,11,5],[13,2,15,11],[17,2,18,5],[17,7,17,8],[19,2,19,11],[20,2,21,3],[20,7,21,8]]}
[]
["Evaluations diagnostiques des élèves au CP Module Circo"]
[]
[]
[]
[null,1]
[]
[null,null,"Ce fichier tableur comporte 4 feuilles (y compris cette page d'accueil)"]
[]
[null,null,"On passe d'une feuille à l'autre en cliquant sur les onglets qui se trouvent en bas à gauche du classeur."]
{"$rows_left_out":18}
{"sheet":"Ecoles","index":1,"n_rows":210,"n_cols":21,"rows_kept":210,"cut":false,"hidden":false,"merged":[[209,2,209,3],[1,3,1,4],[2,3,2,4],[3,3,3,4],[4,3,4,4]]}
[]
[null,null,"Circonscription"]
[null,null,"Département "]
[null,null,"Académie ",null,null,null,null,null,null,null,null,null,null,null,null,null,null,null,null,null,{"$f":"CONCATENATE(D2)","v":""}]
[null,null,"IEN ",null,null,null,null,null,null,null,null,null,null,null,null,null,null,null,null,null,{"$f":"E10","v":0}]
[null,null,null,null,null,null,null,null,null,null,null,null,null,null,null,null,null,null,null,null,0]
[null,null,null,null,null,null,null,null,null,null,null,null,null,null,null,null,null,null,null,null,0]
[null,null,null,null,null,null,null,null,null,null,null,null,null,null,null,null,null,null,null,null,0]
[null,null,null,null,"Ecole + Classe","Nbre élèves",null,null,null,null,null,null,null,null,null,null,null,null,null,null,0]
[null,1,null,null,null,null,null,null,null,null,null,null,null,null,null,null,null,null,null,null,0]
{"$rows_left_out":201}
{"sheet":"Saisie","index":2,"n_rows":310,"n_cols":409,"rows_kept":310,"cut":false,"hidden":false,"merged":[[97,0,128,0],[131,0,151,0],[42,4,43,4],[10,1,11,1],[13,1,15,1],[16,1,18,1],[20,1,24,1],[25,1,28,1],[29,1,31,1],[32,1,35,1],[44,0,84,0],[74,1,77,1],[78,1,81,1],[82,1,84,1],[70,1,73,1],[87,0,87,1],[88,0,88,1],[57,1,60,1],[61,1,63,1],[64,1,67,1],[44,1,52,1],[85,1,85,2],[36,1,36,2],[7,203,7,204],[7,0,7,2],[8,0,8,2],[8,204,9,204],[8,203,9,203],[8,3,9,3],[8,4,9,4],[8,5,9,5],[8,6,9,6],[8,7,9,7],[8,8,9,8],[8,9,9,9],[8,10,9,10],[8,25,9,25],[8,31,9,31],[8,32,9,32],[8,33,9,33],[8,34,9,34],[8,35,9,35],[8,26,9,26],[8,27,9,27],[8,28,9,28],[8,29,9,29],[8,30,9,30],[0,1,0,87],[1,1,1,87],[3,1,3,87],[2,1,2,87],[42,196,43,196],[42,94,43,94],[42,0,42,2],[42,95,43,95],[42,96,43,96],[42,195,43,195],[42,87,43,87],[10,0,35,0],[8,11,9,11],[8,12,9,12],[8,13,9,13],[8,14,9,14],[8,15,9,15],[42,90,43,90],[42,86,43,86],[42,88,43,88],[42,89,43,89],[42,5,43,5],[42,3,43,3],[42,6,43,6],[42,203,43,203],[42,204,43,204],[42,92,43,92],[42,93,43,93],[42,198,43,198],[42,199,43,199],[42,200,43,200],[42,98,43,98],[42,99,43,99],[42,100,43,100],[42,101,43,101],[42,102,43,102],[42,103,43,103],[42,104,43,104],[42,105,43,105],[42,106,43,106],[42,107,43,107],[42,108,43,108],[42,202,43,202],[42,201,43,201],[42,197,43,197],[42,114,43,114],[42,115,43,115],[42,116,43,116],[8,36,9,36],[8,37,9,37],[8,38,9,38],[8,39,9,39],[8,40,9,40],[42,7,43,7],[42,8,43,8],[42,9,43,9],[42,10,43,10],[42,11,43,11],[8,21,9,21],[8,22,9,22],[8,23,9,23],[8,24,9,24],[8,16,9,16],[8,17,9,17],[8,18,9,18],[8,19,9,19],[8,20,9,20],[42,12,43,12],[42,13,43,13],[42,14,43,14],[42,15,43,15],[42,16,43,16],[8,46,9,46],[8,47,9,47],[8,48,9,48],[8,49,9,49],[8,50,9,50],[8,41,9,41],[8,42,9,42],[8,43,9,43],[8,44,9,44],[8,45,9,45],[8,56,9,56],[8,57,9,57],[8,58,9,58],[8,59,9,59],[8,60,9,60],[8,51,9,51],[8,52,9,52],[8,53,9,53],[8,54,9,54],[8,55,9,55],[8,66,9,66],[8,67,9,67],[8,68,9,68],[8,69,9,69],[8,70,9,70],[8,61,9,61],[8,62,9,62],[8,63,9,63],[8,64,9,64],[8,65,9,65],[8,76,9,76],[8,77,9,77],[8,78,9,78],[8,79,9,79],[8,80,9,80],[8,71,9,71],[8,72,9,72],[8,73,9,73],[8,74,9,74],[8,75,9,75],[8,86,9,86],[8,87,9,87],[8,88,9,88],[8,89,9,89],[8,90,9,90],[8,81,9,81],[8,82,9,82],[8,83,9,83],[8,84,9,84],[8,85,9,85],[8,96,9,96],[8,97,9,97],[8,98,9,98],[8,99,9,99],[8,100,9,100],[8,91,9,91],[8,92,9,92],[8,93,9,93],[8,94,9,94],[8,95,9,95],[8,106,9,106],[8,107,9,107],[8,108,9,108],[8,109,9,109],[8,110,9,110],[8,101,9,101],[8,102,9,102],[8,103,9,103],[8,104,9,104],[8,105,9,105],[8,116,9,116],[8,117,9,117],[8,118,9,118],[8,119,9,119],[8,120,9,120],[8,111,9,111],[8,112,9,112],[8,113,9,113],[8,114,9,114],[8,115,9,115],[8,126,9,126],[8,127,9,127],[8,128,9,128],[8,129,9,129],[8,130,9,130],[8,121,9,121],[8,122,9,122],[8,123,9,123],[8,124,9,124],[8,125,9,125],[8,136,9,136],[8,137,9,137],[8,138,9,138],[8,139,9,139],[8,140,9,140],[8,131,9,131],[8,132,9,132],[8,133,9,133],[8,134,9,134],[8,135,9,135],[8,146,9,146],[8,147,9,147],[8,148,9,148],[8,149,9,149],[8,150,9,150],[8,141,9,141],[8,142,9,142],[8,143,9,143],[8,144,9,144],[8,145,9,145],[8,156,9,156],[8,157,9,157],[8,158,9,158],[8,159,9,159],[8,160,9,160],[8,151,9,151],[8,152,9,152],[8,153,9,153],[8,154,9,154],[8,155,9,155],[8,166,9,166],[8,167,9,167],[8,168,9,168],[8,169,9,169],[8,170,9,170],[8,161,9,161],[8,162,9,162],[8,163,9,163],[8,164,9,164],[8,165,9,165],[8,177,9,177],[8,178,9,178],[8,179,9,179],[8,180,9,180],[8,171,9,171],[8,172,9,172],[8,173,9,173],[8,174,9,174],[8,175,9,175],[8,201,9,201],[8,202,9,202],[37,0,37,2],[8,196,9,196],[8,197,9,197],[8,198,9,198],[8,199,9,199],[8,200,9,200],[8,191,9,191],[8,192,9,192],[8,193,9,193],[8,194,9,194],[8,195,9,195],[8,186,9,186],[8,187,9,187],[8,188,9,188],[8,189,9,189],[8,190,9,190],[8,181,9,181],[8,182,9,182],[8,183,9,183],[8,184,9,184],[8,185,9,185],[8,176,9,176],[42,25,43,25],[42,26,43,26],[42,17,43,17],[42,18,43,18],[42,19,43,19],[42,20,43,20],[42,21,43,21],[42,32,43,32],[42,33,43,33],[42,22,43,22],[42,23,43,23],[42,24,43,24],[42,34,43,34],[42,35,43,35],[42,36,43,36],[42,27,43,27],[42,28,43,28],[42,29,43,29],[42,30,43,30],[42,31,43,31],[42,42,43,42],[42,43,43,43],[42,44,43,44],[42,45,43,45],[42,46,43,46],[42,37,43,37],[42,38,43,38],[42,39,43,39],[42,40,43,40],[42,41,43,41],[42,52,43,52],[42,53,43,53],[42,54,43,54],[42,55,43,55],[42,56,43,56],[42,47,43,47],[42,48,43,48],[42,49,43,49],[42,50,43,50],[42,51,43,51],[42,62,43,62],[42,63,43,63],[42,64,43,64],[42,65,43,65],[42,66,43,66],[42,57,43,57],[42,58,43,58],[42,59,43,59],[42,60,43,60],[42,61,43,61],[42,72,43,72],[42,73,43,73],[42,74,43,74],[42,75,43,75],[42,76,43,76],[42,67,43,67],[42,68,43,68],[42,69,43,69],[42,70,43,70],[42,71,43,71],[42,82,43,82],[42,83,43,83],[42,84,43,84],[42,85,43,85],[42,97,43,97],[42,77,43,77],[42,78,43,78],[42,79,43,79],[42,80,43,80],[42,81,43,81],[42,91,43,91],[42,117,43,117],[42,118,43,118],[42,109,43,109],[42,110,43,110],[42,111,43,111],[42,112,43,112],[42,113,43,113],[42,124,43,124],[42,125,43,125],[42,126,43,126],[42,127,43,127],[42,128,43,128],[42,119,43,119],[42,120,43,120],[42,121,43,121],[42,122,43,122],[42,123,43,123],[42,134,43,134],[42,135,43,135],[42,136,43,136],[42,137,43,137],[42,138,43,138],[42,129,43,129],[42,130,43,130],[42,131,43,131],[42,132,43,132],[42,133,43,133],[42,144,43,144],[42,145,43,145],[42,146,43,146],[42,147,43,147],[42,148,43,148],[42,139,43,139],[42,140,43,140],[42,141,43,141],[42,142,43,142],[42,143,43,143],[42,154,43,154],[42,155,43,155],[42,156,43,156],[42,157,43,157],[42,158,43,158],[42,149,43,149],[42,150,43,150],[42,151,43,151],[42,152,43,152],[42,153,43,153],[42,171,43,171],[42,172,43,172],[42,173,43,173],[42,164,43,164],[42,165,43,165],[42,166,43,166],[42,167,43,167],[42,168,43,168],[42,159,43,159],[42,160,43,160],[42,161,43,161],[42,162,43,162],[42,163,43,163],[42,194,43,194],[86,0,86,2],[42,189,43,189],[42,190,43,190],[42,191,43,191],[42,192,43,192],[42,193,43,193],[42,184,43,184],[42,185,43,185],[42,186,43,186],[42,187,43,187],[42,188,43,188],[42,179,43,179],[42,180,43,180],[42,181,43,181],[42,182,43,182],[42,183,43,183],[42,174,43,174],[42,175,43,175],[42,176,43,176],[42,177,43,177],[42,178,43,178],[42,169,43,169],[42,170,43,170]]}
["Circonsription:",{"$f":"Ecoles!D2","v":0}]
["Département :",{"$f":"Ecoles!D3","v":0}]
["Académie :",{"$f":"Ecoles!D4","v":0}]
["IEN :",{"$f":"Ecoles!D5","v":0},null,null,null,null,null,null,null,null,null,null,null,null,null,null,null,null,null,null,null,null,null,null,null,null,null,null,null,null,null,null,null,null,null,null,null,null,null,null,null,null,null,null,null,null,null,null,null,null,null,null,null,null,null,null,null,null,null,null,null,null,null,null,null,null,null,null,null,null,null,null,null,null,null,null,null,null,null,null,null,null,null,null,null,null,null,null,{"$f":"Ecoles!E210","v":0}]
[]
[]
[]
["Coller les résultats des retours de vos écoles en copiant la dernière colonne du fichier école pour le coller dans la colonne correspondante du fichier circo.",null,null,{"$f":"Ecoles!$B10","v":1},{"$f":"D8+1","v":2},{"$f":"E8+1","v":3},{"$f":"F8+1","v":4},5,6,7,8,9,10,11,12,13,14,15,16,17,18,19,20,21,22,23,24,25,26,27,28,29,30,31,32,33,34,35,36,37,38,39,40,41,42,43,44,45,46,47,48,49,50,51,52,53,54,55,56,57,58,59,60,61,62,63,64,65,66,67,{"$f":"BR8+1","v":68},69,70,71,72,73,74,75,76,77,78,79,80,81,82,83,84,85,86,87,88,89,90,91,92,93,94,95,96,97,98,99,100,101,102,103,104,105,106,107,108,109,110,111,112,113,114,115,116,117,118,119,120,121,122,123,124,125,126,127,128,129,130,131,132,133,134,135,136,137,138,139,140,141,142,143,144,145,146,147,148,149,150,151,152,153,154,155,156,157,158,159,160,161,162,163,164,165,166,167,168,169,170,171,172,173,174,175,176,177,178,179,180,181,182,183,184,185,186,187,188,189,190,191,192,193,194,195,196,197,198,199,200]
["Maths",null,null,{"$f":"Ecoles!$E10","v":0},{"$f":"Ecoles!$E11","v":0},{"$f":"Ecoles!$E12","v":0},{"$f":"Ecoles!$E13","v":0},{"$f":"Ecoles!$E14","v":0},{"$f":"Ecoles!$E15","v":0},{"$f":"Ecoles!$E16","v":0},{"$f":"Ecoles!$E17","v":0},{"$f":"Ecoles!$E18","v":0},{"$f":"Ecoles!$E19","v":0},{"$f":"Ecoles!$E20","v":0},{"$f":"Ecoles!$E21","v":0},{"$f":"Ecoles!$E22","v":0},{"$f":"Ecoles!$E23","v":0},{"$f":"Ecoles!$E24","v":0},{"$f":"Ecoles!$E25","v":0},{"$f":"Ecoles!$E26","v":0},{"$f":"Ecoles!$E27","v":0},{"$f":"Ecoles!$E28","v":0},{"$f":"Ecoles!$E29","v":0},{"$f":"Ecoles!$E30","v":0},{"$f":"Ecoles!$E31","v":0},{"$f":"Ecoles!$E32","v":0},{"$f":"Ecoles!$E33","v":0},{"$f":"Ecoles!$E34","v":0},{"$f":"Ecoles!$E35","v":0},{"$f":"Ecoles!$E36","v":0},{"$f":"Ecoles!$E37","v":0},{"$f":"Ecoles!$E38","v":0},{"$f":"Ecoles!$E39","v":0},{"$f":"Ecoles!$E40","v":0},{"$f":"Ecoles!$E41","v":0},{"$f":"Ecoles!$E42","v":0},{"$f":"Ecoles!$E43","v":0},{"$f":"Ecoles!$E44","v":0},{"$f":"Ecoles!$E45","v":0},{"$f":"Ecoles!$E46","v":0},{"$f":"Ecoles!$E47","v":0},{"$f":"Ecoles!$E48","v":0},{"$f":"Ecoles!$E49","v":0},{"$f":"Ecoles!$E50","v":0},{"$f":"Ecoles!$E51","v":0},{"$f":"Ecoles!$E52","v":0},{"$f":"Ecoles!$E53","v":0},{"$f":"Ecoles!$E54","v":0},{"$f":"Ecoles!$E55","v":0},{"$f":"Ecoles!$E56","v":0},{"$f":"Ecoles!$E57","v":0},{"$f":"Ecoles!$E58","v":0},{"$f":"Ecoles!$E59","v":0},{"$f":"Ecoles!$E60","v":0},{"$f":"Ecoles!$E61","v":0},{"$f":"Ecoles!$E62","v":0},{"$f":"Ecoles!$E63","v":0},{"$f":"Ecoles!$E64","v":0},{"$f":"Ecoles!$E65","v":0},{"$f":"Ecoles!$E66","v":0},{"$f":"Ecoles!$E67","v":0},{"$f":"Ecoles!$E68","v":0},{"$f":"Ecoles!$E69","v":0},{"$f":"Ecoles!$E70","v":0},{"$f":"Ecoles!$E71","v":0},{"$f":"Ecoles!$E72","v":0},{"$f":"Ecoles!$E73","v":0},{"$f":"Ecoles!$E74","v":0},{"$f":"Ecoles!$E75","v":0},{"$f":"Ecoles!$E76","v":0},{"$f":"Ecoles!$E77","v":0},{"$f":"Ecoles!$E78","v":0},{"$f":"Ecoles!$E79","v":0},{"$f":"Ecoles!$E80","v":0},{"$f":"Ecoles!$E81","v":0},{"$f":"Ecoles!$E82","v":0},{"$f":"Ecoles!$E83","v":0},{"$f":"Ecoles!$E84","v":0},{"$f":"Ecoles!$E85","v":0},{"$f":"Ecoles!$E86","v":0},{"$f":"Ecoles!$E87","v":0},{"$f":"Ecoles!$E88","v":0},{"$f":"Ecoles!$E89","v":0},{"$f":"Ecoles!$E90","v":0},{"$f":"Ecoles!$E91","v":0},{"$f":"Ecoles!$E92","v":0},{"$f":"Ecoles!$E93","v":0},{"$f":"Ecoles!$E94","v":0},{"$f":"Ecoles!$E95","v":0},{"$f":"Ecoles!$E96","v":0},{"$f":"Ecoles!$E97","v":0},{"$f":"Ecoles!$E98","v":0},{"$f":"Ecoles!$E99","v":0},{"$f":"Ecoles!$E100","v":0},{"$f":"Ecoles!$E101","v":0},{"$f":"Ecoles!$E102","v":0},{"$f":"Ecoles!$E103","v":0},{"$f":"Ecoles!$E104","v":0},{"$f":"Ecoles!$E105","v":0},{"$f":"Ecoles!$E106","v":0},{"$f":"Ecoles!$E107","v":0},{"$f":"Ecoles!$E108","v":0},{"$f":"Ecoles!$E109","v":0},{"$f":"Ecoles!$E110","v":0},{"$f":"Ecoles!$E111","v":0},{"$f":"Ecoles!$E112","v":0},{"$f":"Ecoles!$E113","v":0},{"$f":"Ecoles!$E114","v":0},{"$f":"Ecoles!$E115","v":0},{"$f":"Ecoles!$E116","v":0},{"$f":"Ecoles!$E117","v":0},{"$f":"Ecoles!$E118","v":0},{"$f":"Ecoles!$E119","v":0},{"$f":"Ecoles!$E120","v":0},{"$f":"Ecoles!$E121","v":0},{"$f":"Ecoles!$E122","v":0},{"$f":"Ecoles!$E123","v":0},{"$f":"Ecoles!$E124","v":0},{"$f":"Ecoles!$E125","v":0},{"$f":"Ecoles!$E126","v":0},{"$f":"Ecoles!$E127","v":0},{"$f":"Ecoles!$E128","v":0},{"$f":"Ecoles!$E129","v":0},{"$f":"Ecoles!$E130","v":0},{"$f":"Ecoles!$E131","v":0},{"$f":"Ecoles!$E132","v":0},{"$f":"Ecoles!$E133","v":0},{"$f":"Ecoles!$E134","v":0},{"$f":"Ecoles!$E135","v":0},{"$f":"Ecoles!$E136","v":0},{"$f":"Ecoles!$E137","v":0},{"$f":"Ecoles!$E138","v":0},{"$f":"Ecoles!$E139","v":0},{"$f":"Ecoles!$E140","v":0},{"$f":"Ecoles!$E141","v":0},{"$f":"Ecoles!$E142","v":0},{"$f":"Ecoles!$E143","v":0},{"$f":"Ecoles!$E144","v":0},{"$f":"Ecoles!$E145","v":0},{"$f":"Ecoles!$E146","v":0},{"$f":"Ecoles!$E147","v":0},{"$f":"Ecoles!$E148","v":0},{"$f":"Ecoles!$E149","v":0},{"$f":"Ecoles!$E150","v":0},{"$f":"Ecoles!$E151","v":0},{"$f":"Ecoles!$E152","v":0},{"$f":"Ecoles!$E153","v":0},{"$f":"Ecoles!$E154","v":0},{"$f":"Ecoles!$E155","v":0},{"$f":"Ecoles!$E156","v":0},{"$f":"Ecoles!$E157","v":0},{"$f":"Ecoles!$E158","v":0},{"$f":"Ecoles!$E159","v":0},{"$f":"Ecoles!$E160","v":0},{"$f":"Ecoles!$E161","v":0},{"$f":"Ecoles!$E162","v":0},{"$f":"Ecoles!$E163","v":0},{"$f":"Ecoles!$E164","v":0},{"$f":"Ecoles!$E165","v":0},{"$f":"Ecoles!$E166","v":0},{"$f":"Ecoles!$E167","v":0},{"$f":"Ecoles!$E168","v":0},{"$f":"Ecoles!$E169","v":0},{"$f":"Ecoles!$E170","v":0},{"$f":"Ecoles!$E171","v":0},{"$f":"Ecoles!$E172","v":0},{"$f":"Ecoles!$E173","v":0},{"$f":"Ecoles!$E174","v":0},{"$f":"Ecoles!$E175","v":0},{"$f":"Ecoles!$E176","v":0},{"$f":"Ecoles!$E177","v":0},{"$f":"Ecoles!$E178","v":0},{"$f":"Ecoles!$E179","v":0},{"$f":"Ecoles!$E180","v":0},{"$f":"Ecoles!$E181","v":0},{"$f":"Ecoles!$E182","v":0},{"$f":"Ecoles!$E183","v":0},{"$f":"Ecoles!$E184","v":0},{"$f":"Ecoles!$E185","v":0},{"$f":"Ecoles!$E186","v":0},{"$f":"Ecoles!$E187","v":0},{"$f":"Ecoles!$E188","v":0},{"$f":"Ecoles!$E189","v":0},{"$f":"Ecoles!$E190","v":0},{"$f":"Ecoles!$E191","v":0},{"$f":"Ecoles!$E192","v":0},{"$f":"Ecoles!$E193","v":0},{"$f":"Ecoles!$E194","v":0},{"$f":"Ecoles!$E195","v":0},{"$f":"Ecoles!$E196","v":0},{"$f":"Ecoles!$E197","v":0},{"$f":"Ecoles!$E198","v":0},{"$f":"Ecoles!$E199","v":0},{"$f":"Ecoles!$E200","v":0},{"$f":"Ecoles!$E201","v":0},{"$f":"Ecoles!$E202","v":0},{"$f":"Ecoles!$E203","v":0},{"$f":"Ecoles!$E204","v":0},{"$f":"Ecoles!$E205","v":0},{"$f":"Ecoles!$E206","v":0},{"$f":"Ecoles!$E207","v":0},{"$f":"Ecoles!$E208","v":0},{"$f":"Ecoles!$E209","v":0},"Réponse vide",{"$f":"Ecoles!U4","v":""}]
["Domaine","Numéro exercice","Item"]
{"$rows_left_out":301}
{"sheet":"Analyse Circo","index":3,"n_rows":46,"n_cols":13,"rows_kept":46,"cut":false,"hidden":false,"merged":[[45,1,45,7],[37,0,44,0],[37,1,37,7],[38,1,38,7],[39,1,39,7],[40,1,40,7],[41,1,41,7],[42,1,42,7],[43,1,43,7],[44,1,44,7],[2,3,2,9],[5,10,6,10],[7,10,10,10],[12,10,13,10],[16,10,17,10],[17,1,17,7],[2,0,2,2],[4,0,16,0],[4,1,4,7],[5,1,5,7],[6,1,6,7],[7,1,7,7],[8,1,8,7],[9,1,9,7],[10,1,10,7],[11,1,11,7],[38,10,41,10],[44,10,45,10],[5,12,6,12],[7,12,10,12],[12,12,13,12],[16,12,17,12],[38,12,41,12],[44,12,45,12],[38,11,41,11],[44,11,45,11],[34,0,34,8],[35,0,35,3],[5,11,6,11],[7,11,10,11],[12,11,13,11],[16,11,17,11],[12,1,12,7],[13,1,13,7],[14,1,14,7],[15,1,15,7],[16,1,16,7]]}
["Synthèse des résultats obtenus aux évaluations CP - septembre 2017"]
[null,null,null,null,null,null,null,null,null,null,"Nombre d'élèves"]
[null,null,null,"Cliquer sur la case pour choisir la circonscription ou une école",null,null,null,null,null,null,{"$f":"IF(A3=Ecoles!D2,Ecoles!F210,VLOOKUP(A3,Ecoles!E10:F47,2,0))","v":0}]
[null,null,null,null,null,null,null,null,null,"Compétences",null,null,"Domaine"]
["Français","Connaitre des concepts et du lexique propres à l'écrit (9 items)",null,null,null,null,null,null,1,{"$f":"HLOOKUP($A$3,Saisie!$D$114:$GW$129,3,FALSE)","v":{"$error":"#DIV/0!"}},"Conceptualisation de la langue","A",{"$f":"AVERAGE(J5)","v":{"$error":"#DIV/0!"}}]
[null,"Ecrire les lettres dicteés par l'enseignant (1 item)",null,null,null,null,null,null,2,{"$f":"HLOOKUP($A$3,Saisie!$D$114:$GW$129,4,FALSE)","v":{"$error":"#DIV/0!"}}," Connaissance de l'alphabet","B",{"$f":"AVERAGE(J6:J7)","v":{"$error":"#DIV/0!"}}]
[null,"Reconnaitre les lettres lues par l'enseignant (1 item)",null,null,null,null,null,null,3,{"$f":"HLOOKUP($A$3,Saisie!$D$114:$GW$129,5,FALSE)","v":{"$error":"#DIV/0!"}}]
[null,"Distinguer les syllabes d'un mot prononcé (1 item)",null,null,null,null,null,null,4,{"$f":"HLOOKUP($A$3,Saisie!$D$114:$GW$129,6,FALSE)","v":{"$error":"#DIV/0!"}},"Phonologie","C",{"$f":"(SUM(J8,J9,4*J10,3*J11))/9","v":{"$error":"#DIV/0!"}}]
[null,"Segmenter un mot, repérer et localiser la place de la syllabe prononcée par l'enseignant (1 item)",null,null,null,null,null,null,5,{"$f":"HLOOKUP($A$3,Saisie!$D$114:$GW$129,7,FALSE)","v":{"$error":"#DIV/0!"}}]
[null,"Identifier la syllabe commune à plusieurs mots (4 items)",null,null,null,null,null,null,6,{"$f":"HLOOKUP($A$3,Saisie!$D$114:$GW$129,8,FALSE)","v":{"$error":"#DIV/0!"}}]
{"$rows_left_out":37}
{"sheet":"listes","index":4,"n_rows":8,"n_cols":4,"rows_kept":8,"cut":false,"hidden":true,"merged":[]}
[]
[]
[1,1,1,1]
[9,9,2,2]
["ABS",0,9,3]
[null,"ABS",0,9]
[null,null,"ABS",0]
[null,null,null,"ABS"]